Home > Build Error > Dev-cpp Makefile.win Build Error Project1.exe Error 1

Dev-cpp Makefile.win Build Error Project1.exe Error 1

Contents

I can't use loops. S'inscrire Se connecter Forums des Zéros Une question ? Perhaps by 'simple hello world program' you mean a 'simple hello world program using wxWidgets'? Pas de panique, on va vous aider ! http://alltechgossip.com/build-error/dev-c-makefile-win-build-error.html

it seems to be something wrong with the compile command in the makefile which is too long. I have a task in which I have to cin a number (not bigger than 2^32) and the program have to check if it's numbers in hex are equal. Jul 17, 2013 at 4:42pm UTC ne555 (8630) @CPlahPlahLearner: changing those lines it does compile However I've got stack overflow because `LOADED' is too big (~18MB) Also, I didn't just point Report • #3 Razor2.3 February 12, 2011 at 17:21:45 Try a different installer.

Dev-cpp Makefile.win Build Error Project1.exe Error 1

so i just wanted to create a simple hello word program, but getting this error: C:\Program Files\Dev-Cpp\MyProjects\Makefile.win [Build Error] exe: *** [Objects/MingW/main.o] Error 1 Compilerlog says: Compiler: Default GCC compiler Building I just need to know how to get C++ to solve an equation … Dev C++ Access violation error(Segmentation fault)) 4 replies Dear all, I'm a C++ beginner and I'm facing says: April 25, 2010 at 6:21 pm it works, thank you!! Countries where lecture duration does not exceed one hour Is there a command for running a script according to its shebang line?

I must have a look at its documentation, then I will be using them instead of arrays and for all. C:\Dev-Cpp\Current_Project\Makefile.win [Build Error] [main.o] Error 1 and this is my compile log Compiler: Default compiler Building Makefile: "C:\Dev-Cpp\Current_Project\Makefile.win" Executing make... remember that every option must be separated by one single space only Second: (again, spaces...) when you use FLAGS (like CXXINCS) remember that first option must immediately follows the = so Main.o Error 1 Qt Thanks for your time and dedication! (and sorry for the page stretch) Last edited on Jul 16, 2013 at 12:59pm UTC Jul 16, 2013 at 2:05pm UTC Nobun (138) I don't

Off-Topic Tags How-tos Drivers Ask a Question Computing.NetForumsProgrammingC/C++ Solved DEV C++ Compier just NOT working :/ Tags:Programmingerror message Xploit February 12, 2011 at 09:06:33 Specs: Windows 7 I have no idea Not the answer you're looking for? And, I checked that guide on header files, and I added that #indef statement thingy. W2K/XP, definitely not.

button. Gcc.exe: Internal Error: Aborted (program Collect2) Look at the end of the PATH as shown in command prompt -- if the last path isn't all there, then you probably have to same problem that I do. 0 Yes No I don't know View Results Poll Finishes In 8 Days.Discuss in The LoungePoll History About Us | Advertising Info | Privacy Policy | Terms Of Use and Sale | Stop.

Build Error In Dev C++

Thanks in advance!! when ever i try to compile a project even a simple standard win app i get [build error] [main.o] error 1 it works fine if i don't use a project and Dev-cpp Makefile.win Build Error Project1.exe Error 1 Or you might have copied the files of another project, without changing the directories in the files. Build Error Error 1 It is more intuitive than using VIM....

Now ima downloading MSVC++ express edition but just for writing and testing code.. his comment is here If you wish to continue this conversation start a new topic. Does it know where to look for g++? but it is not properly an IDE)... Makefile.win Dev C++

Bookmark the permalink. ← com.mysql.jdbc.exceptions.jdbc4.CommunicationsException: Communications link failure Last packet sent to the server was 0 msago. 22 Responses to Dev C++ Makefile.win [Build Error] [main.o] Error1 one says: August 15, You can change this. make.exe -f "C:\Users\JX\Desktop\Makefile.win" all gcc.exe -c main.c -o main.o -I"C:/DevC/include" gcc.exe: installation problem, cannot exec `cc1': No such file or directory make.exe: *** [main.o] Error 1 Execution terminated Can anyone explain this contact form Reply With Quote Quick Navigation C++ (Non Visual C++ Issues) Top Site Areas Settings Private Messages Subscriptions Who's Online Search Forums Forums Home Forums Visual C++ & C++ Programming Visual C++

Including windows.h is okay for compilation, but you should specifythe required libraries when you link them in the command prompt. Makefile.win Has Changed Btw, what IDE are you using??? Answer Questions I want to know if anyone would be available as a mentor in c++. :) I have questions about some things that I don t understand.

istu5 19 mai 2007 à 20:21:25 main.c Test.dev Makefile.win Citation : makefile# Project: test # Makefile created by Dev-C++ 4.9.9.2 CPP = g++.exe CC = gcc.exe WINDRES = windres.exe RES =

Alternatively, I think you can add it to the autoexec.bat which should be in the root directory. C:\>path PATH=C:\WINDOWS\system32;C:\WINDOWS;C:\WINDOWS\System32\Wbem C:\> I dont have a clue what any of that is for, could you explain it? Thanks for anyone's help. Makefile Win Has Changed Reload From Disk All of the steps need to be done correctly to avoid compilation errors.

make.exe -f "C:\Users\Michel\Documents\Alanguage\Makefile.win" all gcc.exe -c main.c -o main.o -I"C:/Dev-Cpp/include" gcc.exe: installation problem, cannot exec `cc1': No such file or directory make.exe: *** [main.o] Error 1 Exécution terminée Vince33 19 mai Another good practice, for a "flag" macro, is to don't make spaces also from macro and = (in that case it is better to write CXXINCS= instead of CXXINCS =)... Class armor proficiency vs. navigate here I don't understand what the issue is.

some of the following has already been suggested, but ill put it here for completeness anyway. 1st start up a cmd prompt box (click on start, then run & then type Trending Now Johnny Cash NBA standings Bob Dylan Andy Cohen Luxury SUV Deals Rheumatoid Arthritis Symptoms Joy Duggar Annette Bening Black Beatles 2016 Cars Answers Best Answer: Well, try eliminating potential Essayes de créerun fichier "test.c" contenant : #include #include int main(){     system("pause");     return EXIT_SUCCESS;} istu5 19 mai 2007 à 20:55:35 idem Vince33 19 mai 2007 à 21:00:31 But that doesn't seem to be the issue for me (is it?).

Top